mixiユーザー(id:7593622)

2020年01月22日00:13

25 view

Mac mini(Catalina)にJubatusをインストール jubatus-installer でやってみよう 実行!(その5)zookeeperでエラーの対処

./install.sh: line 422: pushd: zookeeper-3.4.14/src/c: No such file or directory
./install.sh: line 423: ./configure: No such file or directory
ERROR

と出ていたわけだけれども、3.4.13はこのディレクトリ構成みたいだけれど、3.4.14は大きく変わっていて、
zookeeper-3.4.14/zookeeper-client/zookeeper-client-c の下に configure はある。

なので、install.sh の pushd の指定のところを変更してみる。

ちなみに、install.sh 内に書かれている zookeeper の取得先は、3.4.13はもう無かったけれど、
https://archive.apache.org/dist/zookeeper/
にはまだあったので、ここを取得先にして、3.4.13で進めるというのも、きっとできる。

***

zookeeper(3.4.14)は無事通過。次は「jubatus-mpio-0.4.5」でエラー。

In file included from ../jubatus/mp/wavy.h:22:
../jubatus/mp/functional.h:41:10: fatal error: 'tr1/functional' file not found
#include <tr1/functional>
^~~~~~~~~~~~~~~~
1 error generated.
make[2]: *** [libjubatus_mpio_la-wavy_connect.lo] Error 1
make[1]: *** [all-recursive] Error 1
make: *** [all] Error 2
~/Downloads/jubatus-installer-master/download/jubatus_mpio-0.4.5 ~/Downloads/jubatus-installer-master/download ~/Downloads/jubatus-installer-master
~/Downloads/jubatus-installer-master/download ~/Downloads/jubatus-installer-master
ERROR


***
今日も寝る。
0 0

コメント

mixiユーザー

ログインしてコメントを投稿する

<2020年01月>
   1234
567891011
12131415161718
19202122232425
262728293031